{"text_format":"3","workbook":"xlsx","n_sheets":3,"sheets":["Torch details","RFQ Sheet","Data Source"],"not_rendered":{"images":5,"defined_names":5},"read":"whole","date_system":"1900"}

{"sheet":"Torch details","index":0,"n_rows":159,"n_cols":5,"rows_kept":159,"merged":[[0,0,0,3],[45,0,45,3],[46,0,47,0],[48,0,48,3],[49,0,52,0],[53,0,53,3],[54,0,57,0],[58,0,58,3],[59,0,62,0],[63,0,63,3],[64,0,67,0],[68,0,68,3],[69,0,72,0],[73,0,73,3],[74,0,77,0],[79,0,83,0],[84,0,84,3],[85,0,89,0],[90,0,90,3],[92,0,92,3],[97,0,99,0],[100,0,100,3],[102,0,102,3],[103,0,105,0],[106,0,106,3],[108,0,108,3],[109,0,112,0],[114,0,116,0],[117,0,117,3],[118,0,121,0],[131,0,153,0],[131,4,131,7],[141,4,141,7],[155,0,158,0]]}
["TiPTiG Hotwire Water Cooled Torch 18 SC TW"]
{"$rows_empty":43}
["Position","Item","Description","Order Number"]
[]
[1,"TiP TiG Narrow Gap Holder Set 39º Blue","for Fillet Welding",77700701]
[null,"TiP TiG Narrow Gap Holder Set 42º Red","for Root Pass / Pipe Welding",77700702]
[" "]
[2,"TiP TiG Gas Nozzle Jumbo, Size 6","Ø 9,5 mm, 48 mm long",77700530]
[null,"TiP TiG Gas Nozzle Jumbo, Size 8","Ø 12,8 mm, 48 mm long",77700532]
[null,"TiP TiG Gas Nozzle Jumbo, Size 10","Ø 16,0 mm, 48 mm long",77700533]
[null,"TiP TiG Gas Nozzle Jumbo, Size 12","Ø 19,2 mm, 48 mm long",77700534]
[" "]
[3,"TiP TiG Gas Nozzle Jumbo, Size 6L","Ø 9,5 mm, 70 mm long",77700590]
[null,"TiP TiG Gas Nozzle Jumbo, Size 8L","Ø 12,8 mm, 70 mm long",77700592]
[null,"TiP TiG Gas Nozzle Jumbo, Size 10L","Ø 16,0 mm, 70 mm long",77700594]
[null,"TiP TiG Gas Nozzle Jumbo, Size 12L","Ø 19,2 mm, 70 mm long",77700593]
[" "]
[4,"TiP TiG Gas Nozzle Jumbo, Size 6XL","Ø 9,5 mm, 82 mm long",77700595]
[null,"TiP TiG Gas Nozzle Jumbo, Size 8XL","Ø 12,8 mm, 82 mm long",77700596]
[null,"TiP TiG Gas Nozzle Jumbo, Size 10XL","Ø 16,0 mm, 82 mm long",77700597]
[null,"TiP TiG Gas Nozzle Jumbo, Size 12XL","Ø 19,2 mm, 82 mm long",77700598]
[" "]
[5,"TiP TiG Gas Nozzle Jumbo, Size 6XXL","Ø 9,5 mm, 120 mm long",77700582]
[null,"TiP TiG Gas Nozzle Jumbo, Size 8XXL","Ø 12,8 mm, 120 mm long",77700584]
[null,"TiP TiG Gas Nozzle Jumbo, Size 10XXL","Ø 16,0 mm, 120 mm long",77700586]
[null,"TiP TiG Gas Nozzle Jumbo, Size 12XXL","Ø 19,2 mm, 120 mm long",77700587]
[" "]
[6,"TiP TiG Wire Nozzle 40 mm, Green, Ceramic Coated","0,8 mm, without Bronze Spiral",77700750]
[null,"TiP TiG Wire Nozzle 40 mm, Yellow, Ceramic Coated","1,0 mm, without Bronze Spiral",77700751]
[null,"TiP TiG Wire Nozzle 40 mm, Blue, Ceramic Coated","1,2 mm, without Bronze Spiral",77700752]
[null,"TiP TiG Wire Nozzle 40 mm, Red, Ceramic Coated","1,6 mm, without Bronze Spiral",77700753]
[" "]
[7,"TiP TiG Wire Nozzle 40 mm, Green, Ceramic Coated","0,8 mm, with Bronze Spiral 190 mm",77700980]
[7,"TiP TiG Wire Nozzle 40 mm, Yellow, Ceramic Coated","1,0 mm, with Bronze Spiral 190 mm",77700982]
[7,"TiP TiG Wire Nozzle 40 mm, Blue, Ceramic Coated","1,2 mm, with Bronze Spiral 190 mm",77700984]
[7,"TiP TiG Wire Nozzle 40 mm, Red, Ceramic Coated","1,6 mm, with Bronze Spiral 190 mm",77700986]
[]
[8,"TiP TiG Gas Lens Jumbo Ø 1.6 mm","Ø 1,6 mm",99900522]
[8,"TiP TiG Gas Lens Jumbo Ø 2.4 mm","Ø 2,4 mm",99900524]
[8,"TiP TiG Gas Lens Jumbo Ø 3.2 mm","Ø 3,2 mm",99900526]
[8,"TiP TiG Gas Lens Jumbo Ø 4.0 mm","Ø 4,0 mm",99900528]
[8,"TiP TiG Gas Lens Jumbo Ø 4.8 mm","Ø 4,8 mm",99900530]
[" "]
[9,"TiP TiG Collet for Gas Lens Jumbo Ø 1.6 mm","Ø 1,6 mm",99901030]
[9,"TiP TiG Collet for Gas Lens Jumbo Ø 2.4 mm","Ø 2,4 mm",99901031]
[9,"TiP TiG Collet for Gas Lens Jumbo Ø 3.2 mm","Ø 3,2 mm",99901032]
[9,"TiP TiG Collet for Gas Lens Jumbo Ø 4.0 mm","Ø 4,0 mm",99901033]
[9,"TiP TiG Collet for Gas Lens Jumbo Ø 4.8 mm","Ø 4,8 mm",99901034]
["       "]
[10,"TiP TiG Holder Nipple M6 for Orange Liner"," ",77700095]
[" "]
[11,"TiP TiG Holding Ring for Gas Lens Jumbo L"," ",77700630]
[]
[" ","TiPTiG insulator JUMBO ceramic gas cup 18SC/20/AUT 410","Repalced by Part ",77700605]
[null,"TiPTiG insulator for holder torch 18SC","Repalced by Part ",77700214]
[12,"TiP TiG Insulator for Holding Ring Torch 18 SC","Part 1",77700208]
[12,"TiP TiG HF Insulation Ring Torch 18 SC","Part 2",77700209]
[12,"TiP TiG Insulator for Holding Ring Jumbo","Part 3",77700210]
[" "]
[13,"TiP TiG Standard Torch Body"," ",99903360]
[" "]
[14,"TiP TiG Liner Orange","4,10 m long",99906225]
[14,"TiP TiG Liner Orange","6,10 m long",99906226]
[14,"TiP TiG Liner Orange","7,10 m long",99906227]
[" "]
[15,"TiP TiG Adaptor for Brass Spiral"," ",77700632]
[" "]
[16,"TiP TiG Brass Spiral for Torch 18 SC small Nozzles","125 mm long",77700560]
[16,"TiP TiG Brass Spiral for Torch 18 SC Standard","155 mm long",77700562]
[16,"TiP TiG Brass Spiral for Torch 18 SC Jumbo L Nozzles","185 mm long",77700566]
[16,"TiP TiG Brass Spiral for Torch 18 SC Jumbo XL Nozzles","210 mm long",77700567]
[]
[17,"TiP TiG Cap Black short"," ",77700240]
[17,"TiP TiG Cap Black long"," ",77700242]
[17,"TiP TiG O-Ring, Red, Cap Black",null,77700243]
[" "]
[18,"TiP TiG Insulation Sleeve 120 mm"," ",20001007]
[18,"TiP TiG Insulation Sleeve 150 mm"," ",20001008]
[18,"TiP TiG Insulation Sleeve 180 - 190 mm"," ",77700639]
[18,"TiP TiG Insulation Sleeve 200 - 220mm"," ",77700640]
[]
[null,"Maintenance Tools"]
[19,"L Key Set"," ","TTI12001"]
[20,"High Leverage Diagonal Pliers"," ","TTI12002"]
[21,"Dynagrip Clamp 8\""," ","TTI12003"]
[22,"Adjustable Wrench 6\""," ","TTI12004"]
[23,"TiP TiG Torch Holder (Brand MIG)"," ","TTI12005"]
[]
[null,"Torches Old / All in One New Generation"]
["Torches Old / New All in One Generations","TiPTiG HW torch 18 Super Cool U/D , 4,0m Orange Liner","Old Generation",10002460,"Old Generation "]
[null,"TiPTiG HW torch 18 Super Cool U/D  45° , 4,0m Orange Liner","Old Generation",10002461]
[null,"TiPTiG HW torch 18 Super Cool , 6,0m Orange Liner","Old Generation",10002462]
[null,"TiPTiG HW torch 18 Super Cool  45°, 6,0m Orange Liner","Old Generation",10002463]
[null,"TiPTiG HW torch 18 SC U/D , 6,0m Orange Liner","Old Generation",10002464]
[null,"TiPTiG HW torch 18 SC U/D  45°bent , 6,0m Orange Liner","Old Generation",10002465]
[null,"TiPTiG HW torch 18 SC , 7,2m Orange Liner","Old Generation",10002466]
[null,"TiPTiG HW torch 18 SC 45°bent , 7,2m Orange Liner","Old Generation",10002467]
[null,"TiPTiG HW torch 18 SC U/D , 7,2m Orange Liner","Old Generation",10002468]
[null,"TiPTiG HW torch 18 SC U/D 45° bent , 7,2m Orange Liner","Old Generation",10002469]
[null,"TiPTiG HW torch 18 Super Cool , 2,2m Orange Liner","All in One New Generation",20002450,"New All in One"]
[null,"TiPTiG HW torch 18 Super Cool , 4,0m Orange Liner","All in One New Generation",20002461]
[null,"TiPTiG HW torch 18 Super Cool 45° , 4,0m Orange Liner","All in One New Generation",20002462]
[null,"TiPTiG HW torch 18 Super Cool U/D , 4,0m Orange Liner","All in One New Generation",20002463]
[null,"TiPTiG HW torch 18 Super Cool U/D  45° , 4,0m Orange Liner","All in One New Generation",20002464]
[null,"TiPTiG HW torch 18 Super Cool , 6,0m Orange Liner","All in One New Generation",20002465]
[null,"TiPTiG HW torch 18 Super Cool  45°, 6,0m Orange Liner","All in One New Generation",20002466]
[null,"TiPTiG HW torch 18 SC U/D , 6,0m Orange Liner","All in One New Generation",20002467]
[null,"TiPTiG HW torch 18 SC U/D  45°bent , 6,0m Orange Liner","All in One New Generation",20002468]
[null,"TiPTiG HW torch 18 SC , 7,2m Orange Liner","All in One New Generation",20002469]
[null,"TiPTiG HW torch 18 SC 45°bent , 7,2m Orange Liner","All in One New Generation",20002470]
[null,"TiPTiG HW torch 18 SC U/D , 7,2m Orange Liner","All in One New Generation",20002471]
[null,"TiPTiG HW torch 18 SC U/D 45° bent , 7,2m Orange Liner","All in One New Generation",20002472]
[]
["Spare Box","TiPTiG CW/HW Spare box large  torch TW18 SC-JUMBO gas lens","Old / New Version Competible ",77701000]
[null,"TiPTiG CW/HW Spare box small  torch TW18 SC-JUMBO gas lens","Old / New Version Competible ",77701002]
[null,"TiPTiG CW/HW Spare box large  torch TW18 SC-gas lens small","Old / New Version Competible ",77701005]
[null,"TiPTiG CW/HW Spare box small torch TW18 SC-gas lens small","Old / New Version Competible ",77701010]

{"sheet":"RFQ Sheet","index":1,"n_rows":49,"n_cols":18,"rows_kept":49,"merged":[[0,0,0,3],[0,4,0,5],[2,0,2,1],[2,4,2,5],[4,0,4,1],[4,4,4,5],[5,4,5,5],[6,0,6,1],[6,3,6,5],[48,0,48,2],[49,0,49,2]]}
["Torch 18 SC Spare Parts Template Vers 0 / 2020 07",{"$nulls":3},"RFQ Sheet"]
[]
["Your RFQ  Reference:",null,null,"Quote Issue Date:"]
[]
["Company Name:",null,null,"Contact Perosn:"]
[{"$nulls":3},"Email:"]
["Company Address:"]
[]
["It.","Product ID","Product Description ","Description / Specification","Pcs.","Remarks"]
[1,null,{"$f":"IF(ISBLANK(B10),\"\",VLOOKUP(B10,[0]!Data,2,FALSE))","v":""},{"$f":"IF(ISBLANK(B10),\"\",VLOOKUP(B10,[0]!Data,3,FALSE))","v":""}]
[2,null,{"$f":"IF(ISBLANK(B11),\"\",VLOOKUP(B11,[0]!Data,2,FALSE))","v":""},{"$f":"IF(ISBLANK(B11),\"\",VLOOKUP(B11,[0]!Data,3,FALSE))","v":""}]
[3,null,{"$f":"IF(ISBLANK(B12),\"\",VLOOKUP(B12,[0]!Data,2,FALSE))","v":""},{"$f":"IF(ISBLANK(B12),\"\",VLOOKUP(B12,[0]!Data,3,FALSE))","v":""}]
[4,null,{"$f":"IF(ISBLANK(B13),\"\",VLOOKUP(B13,[0]!Data,2,FALSE))","v":""},{"$f":"IF(ISBLANK(B13),\"\",VLOOKUP(B13,[0]!Data,3,FALSE))","v":""}]
[5,null,{"$f":"IF(ISBLANK(B14),\"\",VLOOKUP(B14,[0]!Data,2,FALSE))","v":""},{"$f":"IF(ISBLANK(B14),\"\",VLOOKUP(B14,[0]!Data,3,FALSE))","v":""}]
[6,null,{"$f":"IF(ISBLANK(B15),\"\",VLOOKUP(B15,[0]!Data,2,FALSE))","v":""},{"$f":"IF(ISBLANK(B15),\"\",VLOOKUP(B15,[0]!Data,3,FALSE))","v":""}]
[7,null,{"$f":"IF(ISBLANK(B16),\"\",VLOOKUP(B16,[0]!Data,2,FALSE))","v":""},{"$f":"IF(ISBLANK(B16),\"\",VLOOKUP(B16,[0]!Data,3,FALSE))","v":""}]
[8,null,{"$f":"IF(ISBLANK(B17),\"\",VLOOKUP(B17,[0]!Data,2,FALSE))","v":""},{"$f":"IF(ISBLANK(B17),\"\",VLOOKUP(B17,[0]!Data,3,FALSE))","v":""}]
[9,null,{"$f":"IF(ISBLANK(B18),\"\",VLOOKUP(B18,[0]!Data,2,FALSE))","v":""},{"$f":"IF(ISBLANK(B18),\"\",VLOOKUP(B18,[0]!Data,3,FALSE))","v":""}]
[10,null,{"$f":"IF(ISBLANK(B19),\"\",VLOOKUP(B19,[0]!Data,2,FALSE))","v":""},{"$f":"IF(ISBLANK(B19),\"\",VLOOKUP(B19,[0]!Data,3,FALSE))","v":""}]
[11,null,{"$f":"IF(ISBLANK(B20),\"\",VLOOKUP(B20,[0]!Data,2,FALSE))","v":""},{"$f":"IF(ISBLANK(B20),\"\",VLOOKUP(B20,[0]!Data,3,FALSE))","v":""}]
[12,null,{"$f":"IF(ISBLANK(B21),\"\",VLOOKUP(B21,[0]!Data,2,FALSE))","v":""},{"$f":"IF(ISBLANK(B21),\"\",VLOOKUP(B21,[0]!Data,3,FALSE))","v":""}]
[13,null,{"$f":"IF(ISBLANK(B22),\"\",VLOOKUP(B22,[0]!Data,2,FALSE))","v":""},{"$f":"IF(ISBLANK(B22),\"\",VLOOKUP(B22,[0]!Data,3,FALSE))","v":""}]
[14,null,{"$f":"IF(ISBLANK(B23),\"\",VLOOKUP(B23,[0]!Data,2,FALSE))","v":""},{"$f":"IF(ISBLANK(B23),\"\",VLOOKUP(B23,[0]!Data,3,FALSE))","v":""}]
[15,null,{"$f":"IF(ISBLANK(B24),\"\",VLOOKUP(B24,[0]!Data,2,FALSE))","v":""},{"$f":"IF(ISBLANK(B24),\"\",VLOOKUP(B24,[0]!Data,3,FALSE))","v":""}]
[16,null,{"$f":"IF(ISBLANK(B25),\"\",VLOOKUP(B25,[0]!Data,2,FALSE))","v":""},{"$f":"IF(ISBLANK(B25),\"\",VLOOKUP(B25,[0]!Data,3,FALSE))","v":""}]
[17,null,{"$f":"IF(ISBLANK(B26),\"\",VLOOKUP(B26,[0]!Data,2,FALSE))","v":""},{"$f":"IF(ISBLANK(B26),\"\",VLOOKUP(B26,[0]!Data,3,FALSE))","v":""}]
[18,null,{"$f":"IF(ISBLANK(B27),\"\",VLOOKUP(B27,[0]!Data,2,FALSE))","v":""},{"$f":"IF(ISBLANK(B27),\"\",VLOOKUP(B27,[0]!Data,3,FALSE))","v":""},{"$nulls":13},"tiptig"]
[19,null,{"$f":"IF(ISBLANK(B28),\"\",VLOOKUP(B28,[0]!Data,2,FALSE))","v":""},{"$f":"IF(ISBLANK(B28),\"\",VLOOKUP(B28,[0]!Data,3,FALSE))","v":""}]
[20,null,{"$f":"IF(ISBLANK(B29),\"\",VLOOKUP(B29,[0]!Data,2,FALSE))","v":""},{"$f":"IF(ISBLANK(B29),\"\",VLOOKUP(B29,[0]!Data,3,FALSE))","v":""}]
[21,null,{"$f":"IF(ISBLANK(B30),\"\",VLOOKUP(B30,[0]!Data,2,FALSE))","v":""},{"$f":"IF(ISBLANK(B30),\"\",VLOOKUP(B30,[0]!Data,3,FALSE))","v":""}]
[22,null,{"$f":"IF(ISBLANK(B31),\"\",VLOOKUP(B31,[0]!Data,2,FALSE))","v":""},{"$f":"IF(ISBLANK(B31),\"\",VLOOKUP(B31,[0]!Data,3,FALSE))","v":""}]
[23,null,{"$f":"IF(ISBLANK(B32),\"\",VLOOKUP(B32,[0]!Data,2,FALSE))","v":""},{"$f":"IF(ISBLANK(B32),\"\",VLOOKUP(B32,[0]!Data,3,FALSE))","v":""}]
[24,null,{"$f":"IF(ISBLANK(B33),\"\",VLOOKUP(B33,[0]!Data,2,FALSE))","v":""},{"$f":"IF(ISBLANK(B33),\"\",VLOOKUP(B33,[0]!Data,3,FALSE))","v":""}]
[25,null,{"$f":"IF(ISBLANK(B34),\"\",VLOOKUP(B34,[0]!Data,2,FALSE))","v":""},{"$f":"IF(ISBLANK(B34),\"\",VLOOKUP(B34,[0]!Data,3,FALSE))","v":""}]
[26,null,{"$f":"IF(ISBLANK(B35),\"\",VLOOKUP(B35,[0]!Data,2,FALSE))","v":""},{"$f":"IF(ISBLANK(B35),\"\",VLOOKUP(B35,[0]!Data,3,FALSE))","v":""}]
[27,null,{"$f":"IF(ISBLANK(B36),\"\",VLOOKUP(B36,[0]!Data,2,FALSE))","v":""},{"$f":"IF(ISBLANK(B36),\"\",VLOOKUP(B36,[0]!Data,3,FALSE))","v":""}]
[28,null,{"$f":"IF(ISBLANK(B37),\"\",VLOOKUP(B37,[0]!Data,2,FALSE))","v":""},{"$f":"IF(ISBLANK(B37),\"\",VLOOKUP(B37,[0]!Data,3,FALSE))","v":""}]
[29,null,{"$f":"IF(ISBLANK(B38),\"\",VLOOKUP(B38,[0]!Data,2,FALSE))","v":""},{"$f":"IF(ISBLANK(B38),\"\",VLOOKUP(B38,[0]!Data,3,FALSE))","v":""}]
[30,null,{"$f":"IF(ISBLANK(B39),\"\",VLOOKUP(B39,[0]!Data,2,FALSE))","v":""},{"$f":"IF(ISBLANK(B39),\"\",VLOOKUP(B39,[0]!Data,3,FALSE))","v":""}]
[31,null,{"$f":"IF(ISBLANK(B40),\"\",VLOOKUP(B40,[0]!Data,2,FALSE))","v":""},{"$f":"IF(ISBLANK(B40),\"\",VLOOKUP(B40,[0]!Data,3,FALSE))","v":""}]
[32,null,{"$f":"IF(ISBLANK(B41),\"\",VLOOKUP(B41,[0]!Data,2,FALSE))","v":""},{"$f":"IF(ISBLANK(B41),\"\",VLOOKUP(B41,[0]!Data,3,FALSE))","v":""}]
[33,null,{"$f":"IF(ISBLANK(B42),\"\",VLOOKUP(B42,[0]!Data,2,FALSE))","v":""},{"$f":"IF(ISBLANK(B42),\"\",VLOOKUP(B42,[0]!Data,3,FALSE))","v":""}]
[34,null,{"$f":"IF(ISBLANK(B43),\"\",VLOOKUP(B43,[0]!Data,2,FALSE))","v":""},{"$f":"IF(ISBLANK(B43),\"\",VLOOKUP(B43,[0]!Data,3,FALSE))","v":""}]
[35,null,{"$f":"IF(ISBLANK(B44),\"\",VLOOKUP(B44,[0]!Data,2,FALSE))","v":""},{"$f":"IF(ISBLANK(B44),\"\",VLOOKUP(B44,[0]!Data,3,FALSE))","v":""}]
[]
[]
[{"$nulls":3},"Total Items to be quoted",{"$f":"SUM(E10:E43)","v":0}]
[]
["Notes / Special Instructions / Calrifications required"]

{"sheet":"Data Source","index":2,"n_rows":1019,"n_cols":4,"rows_kept":1019,"hidden":true,"merged":[[0,1,0,2]]}
[null,"Energy Systems Service Pte Ltd (200611540W)\n\n1 Soon Lee Street, #05-57 605627 Singapore / info@ess-singapore.com / ess-singapore.com",null,"Data Product as of 2020\nTiPTiG Internatiojnal AG\nFaerberstrasse 4\n8032 Wollerau / SZ / Swizterland "]
["It.","Product ID","Product Description ","Description"]
[null,10002460,"TiPTiG HW torch 18 Super Cool U/D , 4,0m Orange Liner","Old Generation"]
[null,10002461,"TiPTiG HW torch 18 Super Cool U/D  45° , 4,0m Orange Liner","Old Generation"]
[null,10002462,"TiPTiG HW torch 18 Super Cool , 6,0m Orange Liner","Old Generation"]
[null,10002463,"TiPTiG HW torch 18 Super Cool  45°, 6,0m Orange Liner","Old Generation"]
[null,10002464,"TiPTiG HW torch 18 SC U/D , 6,0m Orange Liner","Old Generation"]
[null,10002465,"TiPTiG HW torch 18 SC U/D  45°bent , 6,0m Orange Liner","Old Generation"]
[null,10002466,"TiPTiG HW torch 18 SC , 7,2m Orange Liner","Old Generation"]
[null,10002467,"TiPTiG HW torch 18 SC 45°bent , 7,2m Orange Liner","Old Generation"]
[null,10002468,"TiPTiG HW torch 18 SC U/D , 7,2m Orange Liner","Old Generation"]
[null,10002469,"TiPTiG HW torch 18 SC U/D 45° bent , 7,2m Orange Liner","Old Generation"]
[null,20002450,"TiPTiG HW torch 18 Super Cool , 2,2m Orange Liner","All in One New Generation"]
[null,20002461,"TiPTiG HW torch 18 Super Cool , 4,0m Orange Liner","All in One New Generation"]
[null,20002462,"TiPTiG HW torch 18 Super Cool 45° , 4,0m Orange Liner","All in One New Generation"]
[null,20002463,"TiPTiG HW torch 18 Super Cool U/D , 4,0m Orange Liner","All in One New Generation"]
[null,20002464,"TiPTiG HW torch 18 Super Cool U/D  45° , 4,0m Orange Liner","All in One New Generation"]
[null,20002465,"TiPTiG HW torch 18 Super Cool , 6,0m Orange Liner","All in One New Generation"]
[null,20002466,"TiPTiG HW torch 18 Super Cool  45°, 6,0m Orange Liner","All in One New Generation"]
[null,20002467,"TiPTiG HW torch 18 SC U/D , 6,0m Orange Liner","All in One New Generation"]
[null,20002468,"TiPTiG HW torch 18 SC U/D  45°bent , 6,0m Orange Liner","All in One New Generation"]
[null,20002469,"TiPTiG HW torch 18 SC , 7,2m Orange Liner","All in One New Generation"]
[null,20002470,"TiPTiG HW torch 18 SC 45°bent , 7,2m Orange Liner","All in One New Generation"]
[null,20002471,"TiPTiG HW torch 18 SC U/D , 7,2m Orange Liner","All in One New Generation"]
[null,20002472,"TiPTiG HW torch 18 SC U/D 45° bent , 7,2m Orange Liner","All in One New Generation"]
[1,77700701,"TiP TiG Narrow Gap Holder Set 39º Blue","For Fillet Welding"]
[2,77700702,"TiP TiG Narrow Gap Holder Set 42º Red","For Root Pass / Pipe Welding"]
[3,77700530,"TiP TiG Gas Nozzle Jumbo, Size 6","Ø 9,5 mm, 48 mm long"]
[4,77700532,"TiP TiG Gas Nozzle Jumbo, Size 8","Ø 12,8 mm, 48 mm long"]
[5,77700533,"TiP TiG Gas Nozzle Jumbo, Size 10","Ø 16,0 mm, 48 mm long"]
[6,77700534,"TiP TiG Gas Nozzle Jumbo, Size 12","Ø 19,2 mm, 48 mm long"]
[7,77700590,"TiP TiG Gas Nozzle Jumbo, Size 6L","Ø 9,5 mm, 70 mm long"]
[8,77700592,"TiP TiG Gas Nozzle Jumbo, Size 8L","Ø 12,8 mm, 70 mm long"]
[9,77700594,"TiP TiG Gas Nozzle Jumbo, Size 10L","Ø 16,0 mm, 70 mm long"]
[10,77700593,"TiP TiG Gas Nozzle Jumbo, Size 12L","Ø 19,2 mm, 70 mm long"]
[11,77700595,"TiP TiG Gas Nozzle Jumbo, Size 6XL","Ø 9,5 mm, 82 mm long"]
[12,77700596,"TiP TiG Gas Nozzle Jumbo, Size 8XL","Ø 12,8 mm, 82 mm long"]
[13,77700597,"TiP TiG Gas Nozzle Jumbo, Size 10XL","Ø 16,0 mm, 82 mm long"]
[14,77700598,"TiP TiG Gas Nozzle Jumbo, Size 12XL","Ø 19,2 mm, 82 mm long"]
[15,77700582,"TiP TiG Gas Nozzle Jumbo, Size 6XXL","Ø 9,5 mm, 120 mm long"]
[16,77700584,"TiP TiG Gas Nozzle Jumbo, Size 8XXL","Ø 12,8 mm, 120 mm long"]
[17,77700586,"TiP TiG Gas Nozzle Jumbo, Size 10XXL","Ø 16,0 mm, 120 mm long"]
[18,77700587,"TiP TiG Gas Nozzle Jumbo, Size 12XXL","Ø 19,2 mm, 120 mm long"]
[19,77700750,"TiP TiG Wire Nozzle 40 mm, Green, Ceramic Coated","0,8 mm, without Bronze Spiral"]
[20,77700751,"TiP TiG Wire Nozzle 40 mm, Yellow, Ceramic Coated","1,0 mm, without Bronze Spiral"]
[21,77700752,"TiP TiG Wire Nozzle 40 mm, Blue, Ceramic Coated","1,2 mm, without Bronze Spiral"]
[22,77700753,"TiP TiG Wire Nozzle 40 mm, Red, Ceramic Coated","1,6 mm, without Bronze Spiral"]
[23,77700980,"TiP TiG Wire Nozzle 40 mm, Green, Ceramic Coated","0,8 mm, with Bronze Spiral 190 mm"]
[24,77700982,"TiP TiG Wire Nozzle 40 mm, Yellow, Ceramic Coated","1,0 mm, with Bronze Spiral 190 mm"]
[25,77700984,"TiP TiG Wire Nozzle 40 mm, Blue, Ceramic Coated","1,2 mm, with Bronze Spiral 190 mm"]
[26,77700986,"TiP TiG Wire Nozzle 40 mm, Red, Ceramic Coated","1,6 mm, with Bronze Spiral 190 mm"]
[null,77701000,"TiPTiG CW/HW Spare box large  torch TW18 SC-JUMBO gas lens","Old / New Version Competible "]
[null,77701002,"TiPTiG CW/HW Spare box small  torch TW18 SC-JUMBO gas lens","Old / New Version Competible "]
[null,77701005,"TiPTiG CW/HW Spare box large  torch TW18 SC-gas lens small","Old / New Version Competible "]
[null,77701010,"TiPTiG CW/HW Spare box small torch TW18 SC-gas lens small","Old / New Version Competible "]
[27,99900522,"TiP TiG Gas Lens Jumbo Ø 1.6 mm","Ø 1,6 mm"]
[28,99900524,"TiP TiG Gas Lens Jumbo Ø 2.4 mm","Ø 2,4 mm"]
[29,99900526,"TiP TiG Gas Lens Jumbo Ø 3.2 mm","Ø 3,2 mm"]
[30,99900528,"TiP TiG Gas Lens Jumbo Ø 4.0 mm","Ø 4,0 mm"]
[31,99900530,"TiP TiG Gas Lens Jumbo Ø 4.8 mm","Ø 4,8 mm"]
[32,99901030,"TiP TiG Collet for Gas Lens Jumbo Ø 1.6 mm","Ø 1,6 mm"]
[33,99901031,"TiP TiG Collet for Gas Lens Jumbo Ø 2.4 mm","Ø 2,4 mm"]
[34,99901032,"TiP TiG Collet for Gas Lens Jumbo Ø 3.2 mm","Ø 3,2 mm"]
[35,99901033,"TiP TiG Collet for Gas Lens Jumbo Ø 4.0 mm","Ø 4,0 mm"]
[36,99901034,"TiP TiG Collet for Gas Lens Jumbo Ø 4.8 mm","Ø 4,8 mm"]
[37,77700095,"TiP TiG Holder Nipple M6 for Orange Liner"," "]
[38,77700630,"TiP TiG Holding Ring for Gas Lens Jumbo L"," "]
[39,77700208,"TiP TiG Insulator for Holding Ring Torch 18 SC","Part 1"]
[40,77700209,"TiP TiG HF Insulation Ring Torch 18 SC, ","Part 2"]
[41,77700210,"TiP TiG Insulator for Holding Ring Jumbo, ","Part 3"]
[42,99903360,"TiP TiG Standard Torch Body"," "]
[43,99906225,"TiP TiG Liner Orange","4,10 m long"]
[44,99906226,"TiP TiG Liner Orange","6,10 m long"]
[45,99906227,"TiP TiG Liner Orange","7,10 m long"]
[46,77700632,"TiP TiG Adaptor for Brass Spiral"," "]
[47,77700560,"TiP TiG Brass Spiral for Torch 18 SC small Nozzles","125 mm long"]
[48,77700562,"TiP TiG Brass Spiral for Torch 18 SC Standard","155 mm long"]
[49,77700566,"TiP TiG Brass Spiral for Torch 18 SC Jumbo L Nozzles","185 mm long"]
[50,77700567,"TiP TiG Brass Spiral for Torch 18 SC Jumbo XL Nozzles","210 mm long"]
[51,77700240,"TiP TiG Cap ","Black short"]
[52,77700242,"TiP TiG Cap ","Black long"]
[53,77700243,"TiP TiG O-Ring,"," Red, Cap Black"]
[54,20001007,"TiP TiG Insulation ","Sleeve 120 mm"]
[55,20001008,"TiP TiG Insulation ","Sleeve 150 mm"]
[56,77700639,"TiP TiG Insulation ","Sleeve 180 - 190 mm"]
[57,77700640,"TiP TiG Insulation ","Sleeve 200 - 220mm"]
[58,"TTI12001","L Key Set"," "]
[59,"TTI12002","High Leverage Diagonal Pliers"," "]
[60,"TTI12003","Dynagrip ","Clamp 8\""]
[61,"TTI12004","Adjustable ","Wrench 6\""]
[62,"TTI12005","TiP TiG Torch Holder (Brand MIG)"," "]
[63]
[64]
[65]
[66]
[67]
[68]
[69]
[70]
[71]
[72]
[73]
[74]
[75]
[76]
[77]
[78]
[79]
[80]
[81]
[82]
[83]
[84]
[85]
[86]
[87]
[88]
[89]
[90]
[91]
[92]
[93]
[94]
[95]
[96]
[97]
[98]
[99]
[100]
[101]
[102]
[103]
[104]
[105]
[106]
[107]
[108]
[109]
[110]
[111]
[112]
[113]
[114]
[115]
[116]
[117]
[118]
[119]
[120]
[121]
[122]
[123]
[124]
[125]
[126]
[127]
[128]
[129]
[130]
[131]
[132]
[133]
[134]
[135]
[136]
[137]
[138]
[139]
[140]
[141]
[142]
[143]
[144]
[145]
[146]
[147]
[148]
[149]
[150]
[151]
[152]
[153]
[154]
[155]
[156]
[157]
[158]
[159]
[160]
[161]
[162]
[163]
[164]
[165]
[166]
[167]
[168]
[169]
[170]
[171]
[172]
[173]
[174]
[175]
[176]
[177]
[178]
[179]
[180]
[181]
[182]
[183]
[184]
[185]
[186]
[187]
[188]
[189]
[190]
[191]
[192]
[193]
[194]
[195]
[196]
[197]
[198]
[199]
[200]
[201]
[202]
[203]
[204]
[205]
[206]
[207]
[208]
[209]
[210]
[211]
[212]
[213]
[214]
[215]
[216]
[217]
[218]
[219]
[220]
[221]
[222]
[223]
[224]
[225]
[226]
[227]
[228]
[229]
[230]
[231]
[232]
[233]
[234]
[235]
[236]
[237]
[238]
[239]
[240]
[241]
[242]
[243]
[244]
[245]
[246]
[247]
[248]
[249]
[250]
[251]
[252]
[253]
[254]
[255]
[256]
[257]
[258]
[259]
[260]
[261]
[262]
[263]
[264]
[265]
[266]
[267]
[268]
[269]
[270]
[271]
[272]
[273]
[274]
[275]
[276]
[277]
[278]
[279]
[280]
[281]
[282]
[283]
[284]
[285]
[286]
[287]
[288]
[289]
[290]
[291]
[292]
[293]
[294]
[295]
[296]
[297]
[298]
[299]
[300]
[301]
[302]
[303]
[304]
[305]
[306]
[307]
[308]
[309]
[310]
[311]
[312]
[313]
[314]
[315]
[316]
[317]
[318]
[319]
[320]
[321]
[322]
[323]
[324]
[325]
[326]
[327]
[328]
[329]
[330]
[331]
[332]
[333]
[334]
[335]
[336]
[337]
[338]
[339]
[340]
[341]
[342]
[343]
[344]
[345]
[346]
[347]
[348]
[349]
[350]
[351]
[352]
[353]
[354]
[355]
[356]
[357]
[358]
[359]
[360]
[361]
[362]
[363]
[364]
[365]
[366]
[367]
[368]
[369]
[370]
[371]
{"$rows_left_out":619}